{"text_format":"3","workbook":"xlsx","n_sheets":11,"sheets":["CONDITIONS","Len_DB","Input","RefText_DB","Output","Calculation Report","Relazione di Calcolo AT SUPPORT","EJeff","sharp metal","CLT panel","Dati"],"not_rendered":{"images":76,"macros":1,"defined_names":21,"comments":4},"read":"whole","date_system":"1900"}

{"sheet":"CONDITIONS","index":0,"n_rows":66,"n_cols":5,"rows_kept":66,"merged":[[1,3,3,3],[2,4,3,4],[6,2,8,4],[11,1,11,4],[15,2,15,4],[19,2,19,4],[23,2,23,4],[28,2,28,4],[32,2,32,4],[36,2,36,4],[40,2,40,4],[44,2,44,4],[48,2,48,4],[53,2,53,4],[58,2,58,4],[62,2,62,4],[63,2,63,4],[65,0,67,5]]}
[]
[{"$nulls":3},"SHARP_METAL_CALCULATOR\nv1.1",{"$f":"INDEX(LEN_CON[],1,MATCH($E$3,LEN_CON[#Headers],0))","v":"Language"}]
[{"$nulls":4},"EN"]
[]
[]
[{"$nulls":3},{"$f":"INDEX(LEN_CON[],2,MATCH($E$3,LEN_CON[#Headers],0))","v":"SHARP METAL CALCULATOR"}]
[null,null,{"$f":"INDEX(LEN_CON[],3,MATCH($E$3,LEN_CON[#Headers],0))","v":"GENERAL TERMS AND CONDITIONS OF THE LICENSE AGREEMENT FOR THE USE OF THE SPREADSHEET \"SHARP_METAL_CALCULATOR\""}]
[]
[]
[]
{"$rows_left_out":57}
{"sheet":"Len_DB","index":1,"n_rows":257,"n_cols":8,"rows_kept":257,"hidden":true,"merged":[[1,2,1,6],[5,2,5,6],[37,2,37,6],[88,2,88,6],[129,2,129,6]]}
[]
[null,null,"LENGUAGES"]
[]
[null,null,"IT","EN","DE","FR","ES"]
[]
[null,null,"CONDITIONS"]
[]
[null,"Column1","IT","EN","DE","FR","ES","Column2"]
[null,1,"Lingua","Language","Sprache","Langue","Idioma"]
[null,2,"SHARP METAL CALCULATOR","SHARP METAL CALCULATOR","SHARP METAL CALCULATOR","SHARP METAL CALCULATOR","SHARP METAL CALCULATOR"]
{"$rows_left_out":248}
{"sheet":"Input","index":2,"n_rows":46,"n_cols":12,"rows_kept":46,"hidden":true,"merged":[[0,3,0,8],[0,10,0,11],[2,1,2,11],[4,2,4,3],[4,8,4,11],[5,2,5,5],[5,8,6,11],[6,2,6,5],[7,2,7,5],[8,2,8,5],[9,2,9,5],[11,1,11,11],[13,2,13,3],[13,8,13,11],[14,2,14,3],[14,8,14,11],[15,2,15,3],[17,1,17,11],[19,1,19,5],[19,7,19,11],[21,2,21,5],[21,8,21,11],[23,1,23,11],[25,1,25,5],[25,7,25,11],[27,2,27,5],[27,8,27,9],[28,2,28,3],[28,8,28,9],[29,2,29,3],[29,8,29,9],[30,2,30,3],[32,2,32,3],[34,1,34,11],[36,1,36,11],[38,1,38,5],[38,7,38,11],[40,2,40,5],[40,8,40,11],[41,2,41,3],[41,8,41,9],[42,4,42,5],[42,10,42,11],[43,2,43,3],[43,8,43,9],[45,2,45,3],[45,8,45,9],[47,1,47,5],[47,7,47,11]]}
[{"$nulls":3},"SHARP_METAL_CALCULATOR_v1.1",{"$nulls":6},"SHARP METAL"]
[]
[null,{"$f":"INDEX(LEN_IN[],1,MATCH(CONDITIONS!$E$3,Len_DB!$C$8:$H$8,0)+1)","v":"Project informations"}]
[]
[null,{"$f":"INDEX(LEN_IN[],2,MATCH(CONDITIONS!$E$3,Len_DB!$C$8:$H$8,0)+1)","v":"Data"},{"$f":"TODAY()","v":"2026-07-20"},{"$nulls":4},{"$f":"INDEX(LEN_IN[],8,MATCH(CONDITIONS!$E$3,Len_DB!$C$8:$H$8,0)+1)","v":"Standard"},"UNI EN 1995:2014"]
[null,{"$f":"INDEX(LEN_IN[],3,MATCH(CONDITIONS!$E$3,Len_DB!$C$8:$H$8,0)+1)","v":"Municipality"},{"$nulls":5},{"$f":"INDEX(LEN_IN[],9,MATCH(CONDITIONS!$E$3,Len_DB!$C$8:$H$8,0)+1)","v":"Notes"}]
[null,{"$f":"INDEX(LEN_IN[],4,MATCH(CONDITIONS!$E$3,Len_DB!$C$8:$H$8,0)+1)","v":"Province"}]
[null,{"$f":"INDEX(LEN_IN[],5,MATCH(CONDITIONS!$E$3,Len_DB!$C$8:$H$8,0)+1)","v":"Project"}]
[null,{"$f":"INDEX(LEN_IN[],6,MATCH(CONDITIONS!$E$3,Len_DB!$C$8:$H$8,0)+1)","v":"Designer"}]
[null,{"$f":"INDEX(LEN_IN[],7,MATCH(CONDITIONS!$E$3,Len_DB!$C$8:$H$8,0)+1)","v":"Client"}]
{"$rows_left_out":37}
{"sheet":"RefText_DB","index":3,"n_rows":17,"n_cols":2,"rows_kept":17,"hidden":true}
[]
[]
[]
[null,"UNI EN 1995:2014"]
[null,"NTC2018"]
[]
[]
[]
[null,"SHARP METAL (alone) + TBS MAX@a = 250mm"]
[null,"SHARP METAL + TBS MAX@a ≤ 100mm"]
{"$rows_left_out":8}
{"sheet":"Output","index":4,"n_rows":81,"n_cols":12,"rows_kept":81,"hidden":true,"merged":[[0,3,0,8],[0,10,0,11],[2,1,2,11],[4,2,4,3],[4,8,4,11],[5,2,5,5],[5,8,6,11],[6,2,6,5],[7,2,7,5],[8,2,8,5],[9,2,9,5],[11,1,11,11],[15,1,15,5],[15,7,15,11],[17,3,17,4],[17,9,17,10],[18,3,18,4],[18,9,18,10],[19,3,19,4],[19,9,19,10],[21,1,21,5],[23,3,23,4],[24,3,24,4],[26,1,26,11],[30,1,30,5],[30,7,30,11],[32,3,32,4],[32,9,32,10],[33,3,33,4],[33,9,33,10],[34,3,34,4],[34,9,34,10],[36,3,36,4],[36,9,36,10],[37,3,37,4],[37,9,37,10],[38,3,38,4],[38,9,38,10],[40,1,40,5],[42,3,42,4],[43,3,43,4],[45,3,45,4],[46,3,46,4],[48,1,48,11],[56,1,56,11],[64,3,64,8],[64,10,64,11],[66,1,66,11],[70,3,70,4],[71,2,71,3],[72,2,72,3],[80,7,80,11]]}
[{"$nulls":3},"SHARP_METAL_CALCULATOR_v1.1",{"$nulls":6},"SHARP METAL"]
[]
[null,{"$f":"Input!B3","v":"Project informations"}]
[]
[null,{"$f":"Input!B5","v":"Data"},{"$f":"Input!C5","v":"2026-07-20"},{"$nulls":4},{"$f":"INDEX(LEN_IN[],8,MATCH(CONDITIONS!$E$3,Len_DB!$C$8:$H$8,0)+1)","v":"Standard"},{"$f":"IF(ISBLANK(Input!I5),\"\",Input!I5)","v":"UNI EN 1995:2014"}]
[null,{"$f":"Input!B6","v":"Municipality"},{"$f":"IF(ISBLANK(Input!C6),\"\",Input!C6)","v":""},{"$nulls":4},{"$f":"INDEX(LEN_IN[],9,MATCH(CONDITIONS!$E$3,Len_DB!$C$8:$H$8,0)+1)","v":"Notes"},{"$f":"IF(ISBLANK(Input!I6),\"\",Input!I6)","v":""}]
[null,{"$f":"Input!B7","v":"Province"},{"$f":"IF(ISBLANK(Input!C7),\"\",Input!C7)","v":""}]
[null,{"$f":"Input!B8","v":"Project"},{"$f":"IF(ISBLANK(Input!C8),\"\",Input!C8)","v":""}]
[null,{"$f":"Input!B9","v":"Designer"},{"$f":"IF(ISBLANK(Input!C9),\"\",Input!C9)","v":""}]
[null,{"$f":"Input!B10","v":"Client"},{"$f":"IF(ISBLANK(Input!C10),\"\",Input!C10)","v":""}]
{"$rows_left_out":72}
{"sheet":"Calculation Report","index":5,"n_rows":1006,"n_cols":12,"rows_kept":1006,"hidden":true,"merged":[[6,2,11,7],[10,10,10,11],[12,9,12,11],[14,3,14,11],[16,3,16,10],[18,3,18,8],[23,3,23,6],[23,8,23,11],[27,3,27,6],[27,8,27,11],[34,1,34,11],[36,2,36,9],[38,1,38,5],[38,7,38,11],[40,2,40,5],[40,8,40,11],[44,2,44,3],[44,8,44,9],[45,2,45,3],[45,8,45,9],[47,1,47,11],[49,2,49,3],[49,8,49,11],[50,2,50,3],[51,2,51,3],[51,8,51,11],[53,1,53,11],[55,1,55,11],[57,2,57,3],[58,2,58,3],[59,2,59,3],[61,1,61,11],[64,1,64,11],[66,2,66,4],[70,1,70,3],[86,1,86,11],[88,2,88,4],[92,1,92,3],[111,1,111,11],[113,1,113,5],[113,7,113,11],[115,2,115,3],[115,8,115,9],[116,2,116,3],[116,8,116,9],[117,8,117,9],[118,2,118,3],[120,1,120,11],[122,1,122,11],[124,1,124,5],[124,7,124,11],[126,1,126,5],[126,7,126,11],[128,1,128,5],[128,7,128,11],[130,2,130,3],[130,8,130,9],[134,2,134,3],[134,8,134,9],[136,2,136,3],[136,8,136,9],[138,1,138,5],[138,7,138,11],[140,2,140,3],[140,8,140,9],[141,2,141,3],[141,8,141,9],[142,2,142,3],[142,8,142,9],[144,1,145,1],[144,2,144,3],[144,7,145,7],[144,8,144,9],[145,2,145,3],[145,8,145,9],[147,1,147,11],[149,2,149,3],[149,8,149,9],[150,2,150,3],[150,8,150,9],[151,2,151,3],[151,8,151,9],[154,1,154,11],[156,2,156,3],[157,2,157,3],[162,1,162,5],[162,7,162,11],[164,1,164,11],[169,1,169,11],[171,1,171,5],[171,7,171,11],[173,2,173,3],[173,8,173,9],[174,2,174,3],[174,8,174,9],[176,1,176,5],[184,2,184,3],[186,1,186,5],[188,7,194,11],[192,2,192,3],[196,7,196,11],[198,8,198,9],[202,1,202,11],[204,1,204,5],[204,7,204,11],[206,2,206,3],[206,8,206,9],[209,2,209,3],[209,8,209,9],[210,2,210,3],[210,8,210,9],[212,1,212,5],[220,2,220,3],[225,2,225,3],[233,1,233,5],[238,1,238,11],[240,1,240,5],[240,7,240,11],[242,2,242,3],[242,8,242,9],[245,2,245,3],[245,8,245,9],[246,2,246,3],[246,8,246,9],[248,1,248,5],[256,2,256,3],[261,2,261,3],[269,1,269,5]]}
[{"$nulls":7},{"$f":"IF(AND(Output!F19=\"OK\",Output!F20=\"OK\",Output!L19=\"OK\",Output!L20=\"OK\",Output!F25=\"OK\",Output!F34=\"OK\",Output!F35=\"OK\",Output!F38=\"OK\",Output!F39=\"OK\",Output!L34=\"OK\",Output!L35=\"OK\",Output!L38=\"OK\",Output!L39=\"OK\",Output!F44=\"OK\",Output!F47=\"OK\",Output!L55=\"OK\",Output!L63=\"OK\",Output!L75=\"OK\",Output!L79=\"OK\"),\"OK\",\"NO\")","v":"OK"}]
[]
[]
[]
[]
[]
[null,null,{"$f":"INDEX(LEN_REPORT[],1,MATCH(CONDITIONS!$E$3,Len_DB!$C$8:$H$8,0)+1)","v":"Technical calculation report"}]
[]
[]
[]
{"$rows_left_out":984}
{"sheet":"Relazione di Calcolo AT SUPPORT","index":6,"n_rows":991,"n_cols":15,"rows_kept":991,"hidden":true,"merged":[[0,0,0,8],[4,3,4,6],[6,3,6,6],[8,3,8,6],[38,1,39,7],[46,2,46,6],[48,2,48,6],[49,2,49,6],[50,2,50,6],[52,2,52,6],[61,1,71,8],[72,1,77,8],[88,1,98,8],[103,1,103,7],[104,1,104,3],[105,3,105,4],[105,5,105,7],[106,3,106,4],[106,5,106,7],[120,1,120,7],[131,1,131,7],[140,1,140,7],[143,1,143,8],[144,1,144,8],[146,1,146,3],[146,5,146,7],[147,5,147,6],[147,7,147,8],[153,1,153,3],[158,1,158,3],[163,1,163,7],[167,1,167,8],[168,1,168,8],[170,1,170,3],[170,5,170,8],[171,5,171,6],[171,7,171,8],[177,1,177,3],[182,1,182,3],[185,1,185,7],[198,1,198,7],[205,1,205,3],[208,1,208,3],[214,1,214,7],[227,1,227,7],[228,1,228,6],[232,1,232,6],[234,1,234,6],[237,1,237,4],[241,1,241,4],[246,1,246,7],[312,1,312,7],[320,1,320,4],[339,1,339,5],[391,1,391,7],[399,1,399,4],[417,1,417,5],[471,1,471,7],[473,1,473,6],[499,1,499,6],[535,0,535,5],[557,1,557,6],[577,1,577,6],[595,1,595,6],[604,1,604,7],[606,1,606,6],[627,1,627,6],[670,1,670,6],[692,1,692,6],[714,1,714,6],[733,1,733,6],[740,1,740,7],[742,1,742,6],[766,1,766,6],[798,1,798,6],[821,1,821,6],[842,1,842,6],[855,1,855,6],[865,1,865,7],[918,1,918,7]]}
[]
[{"$nulls":7},"Rev27/18"]
[]
[]
[null,null,"Comune di:",{"$f":"IF(Input!#REF!=\"\",\"\",Input!#REF!)","v":{"$error":"#REF!"}}]
[]
[null,null,"Provincia di: ",{"$f":"IF(Input!#REF!=\"\",\"\",Input!#REF!)","v":{"$error":"#REF!"}}]
[]
[null,null,"Progettato da:",{"$f":"IF(Input!#REF!=\"\",\"\",Input!#REF!)","v":{"$error":"#REF!"}}]
{"$rows_empty":29}
{"$rows_left_out":881}
{"sheet":"EJeff","index":7,"n_rows":43,"n_cols":35,"rows_kept":43,"hidden":true,"merged":[[4,26,4,29],[4,31,4,34],[6,1,6,8],[6,9,6,10],[6,11,6,12],[6,14,6,16],[6,17,6,19],[6,20,6,21],[6,23,6,24],[6,26,6,27],[6,28,6,29],[6,31,6,32],[6,33,6,34],[7,1,8,1],[7,9,7,10],[7,11,7,12],[7,14,7,16],[7,17,7,19],[7,20,7,21],[7,23,7,24],[7,26,7,27],[7,28,7,29],[7,31,7,32],[7,33,7,34]]}
[null,"DO NOT TOUCH THESE. Change in DATA or in CLT PANEL"]
[null,"b(mm)",null,"E0,mean","E90,mean","Gmean","Gr,mean",null,null,"bef,ij(mm)",{"$f":"(Input!$E$30-Input!$K$30)*(0.5-0.35*((Input!$E$30-Input!$K$30)/Input!$E$33)^0.9*($D$3*MAX($X$21:$Y$21)/($F$3*SUM($X$21:$Y$21)))^0.45)","v":{"v":230.98665987874804,"d":"230.99"}},{"$nulls":20},"bef,ij(mm)",{"$f":"MAX(C10:C20)","v":{"v":30,"d":"30.00"}},"[mm]"]
[null,{"$f":"Input!$E$30","v":800},null,{"$f":"INDEX(TimberType[],MATCH(Input!$C$22,TimberType[Classe],0),MATCH(D2,TimberType[#Headers],0))","v":11000},{"$f":"INDEX(TimberType[],MATCH(Input!$C$22,TimberType[Classe],0),MATCH(E2,TimberType[#Headers],0))","v":370},{"$f":"INDEX(TimberType[],MATCH(Input!$C$22,TimberType[Classe],0),MATCH(F2,TimberType[#Headers],0))","v":690},69,{"$f":"Input!$C$28","v":"80mm-3-   30 20 30   "},null,"bef",{"$f":"K2*2+Input!$K$30","v":{"v":611.973319757496,"d":"611.97"}},"scelto in INPUT",{"$f":"Input!C28","v":"80mm-3-   30 20 30   "},{"$nulls":10},"NUOVO EUROCODICE5 O STORANESO",{"$nulls":7},"bef",{"$f":"AG2*2+Input!$K$30","v":{"v":210,"d":"210.00"}},"[mm]"]
[]
[{"$nulls":26},"At mid span",{"$nulls":4},"At support"]
[null,"Berechnung von Brettsperrholzelementen"]
[null,"Se non c'è lamella, indicare d=0",{"$nulls":7},"INERZIA",null,"Biegesteifigkeiten",null,"Drillsteifigkeit1)","Plattenschubsteifigkeit ",null,null,"Plattenschubsteifigkeit ",null,null,"Dehnsteifigkeiten",null,"Scheibenschubsteifigkeit ","area",null,null,"INERZIA CON BASE EFFICACE",null,"area CON BASE EFFICACE",null,null,"INERZIA CON BASE EFFICACE",null,"area CON BASE EFFICACE"]
[null,"Lagen","di","Exx,i","Eyy,i","Gxz,i","Gyz,i","Gxy,i=Gyx,i","zi","mm^4",null,"[MNm²/m] ∙10-3",null,"[MN/m] ∙10-3","[MN/m] ∙10-3",null,null,"[MN/m] ∙10-3",null,null,"[MN/m]",null,"[MN/m]","mm^2",null,null,"[mm4]",null,"[mm2]",null,null,"[mm4]",null,"[mm2]"]
[null,null,"[mm]","[MN/m²]","[MN/m²]","[MN/m²]","[MN/m²]","[MN/m²]","[mm]","jxx,i ","Jy,i","Bx,i ","By,i","Bxy,i","EIx,B,i","cxz,i","1/Sxz,i","EIy,B,i","cxz,i","1/Sxz,i","Dx,i","Dx,i","Dxj,i","AX","AY",null,"jxx,i","Jy,i","AX","AY",null,"jxx,i","Jy,i","AX","AY"]
[null,11,0,{"$f":"D3","v":11000},{"$f":"E3","v":370},{"$f":"F3","v":690},{"$f":"G3","v":69},690,{"$f":"I11-C11/2-C10/2","v":-40},{"$f":"IF(D10>E10,(C10^3/12+C10*(I10^2))*$B$3,0)","v":0},{"$f":"IF(D10<E10,(C10^3/12+C10*(I10^2))*$B$3,0)","v":0},{"$f":"(D10*(C10/1000)^3/12+D10*C10/1000*(I10/1000)^2)*10^3","v":{"v":0,"d":"0.00"}},{"$f":"(E10*(C10/1000)^3/12+E10*C10/1000*(I10/1000)^2)*1000","v":{"v":0,"d":"0.00"}},{"$f":"(2*H10*C10/1000*(I10/1000)^2+H10*(C10/1000)^3/6)*1000","v":{"v":0,"d":"0.00"}},{"$f":"(D10*C10/1000*(I10/1000)^2)*1000","v":0},{"$f":"1/$O$21*D10*C10/1000*I10/1000*10^3","v":0},{"$f":"IF(C10=0,\"\",(C10/1000)/(3*F10)*(P10+P10^2)*1000)","v":""},{"$f":"(E10*C10/1000*(I10/1000)^2)*1000","v":0},{"$f":"1/$R$21*E10*C10/1000*I10/1000*10^3","v":0},{"$f":"IF(C10=0,\"\",(C10/1000)/(3*G10)*(S10+S10^2)*1000)","v":""},{"$f":"C10/1000*D10","v":0},{"$f":"C10/1000*E10","v":0},{"$f":"C10/1000*H10","v":0},{"$f":"IF(D10>E10,$B$3*C10,0)","v":0},{"$f":"IF(D10<E10,$B$3*C10,0)","v":0},null,{"$f":"IF(D10>E10,(C10^3/12+C10*(I10^2))*$K$3,0)","v":0},{"$f":"IF(D10<E10,(C10^3/12+C10*(I10^2))*$K$3,0)","v":0},{"$f":"IF(D10>E10,$K$3*C10,0)","v":0},{"$f":"IF(D10<E10,$K$3*C10,0)","v":0},null,{"$f":"IF(D10>E10,(C10^3/12+C10*(I10^2))*$AG$3,0)","v":0},{"$f":"IF(D10<E10,(C10^3/12+C10*(I10^2))*$AG$3,0)","v":0},{"$f":"IF(D10>E10,$AG$3*C10,0)","v":0},{"$f":"IF(D10<E10,$AG$3*C10,0)","v":0}]
{"$rows_left_out":34}
{"sheet":"sharp metal","index":8,"n_rows":14,"n_cols":8,"rows_kept":14,"hidden":true,"merged":[[1,1,1,3],[1,5,1,7]]}
[]
[null,"At support",{"$nulls":3},"At mid span"]
[]
[null,"INPUT L/4",{"$f":"Input!C41","v":"SHARP METAL + TBS MAX@a ≤ 100mm"},null,null,"INPUT L/2",{"$f":"Input!I41","v":"SHARP METAL + TBS MAX@a ≤ 100mm"}]
[null,"b",50,"mm",null,"b",50,"mm"]
[null,"n°",{"$f":"Input!$E$43","v":2},null,null,"n°",{"$f":"Input!$K$43","v":1}]
[null,"lef",{"$f":"MIN(0.9*1000,1000-10)","v":900},"mm",null,"lef",{"$f":"MIN(0.9*1000,1000-10)","v":900},"mm"]
[null,"kv,0,0",{"$f":"IF(C4=RefText_DB!$B$9,1.76,IF(C4=RefText_DB!$B$10,3.05,IF(C4=RefText_DB!$B$11,2.47,\"errore\")))","v":3.05},"N/mm3",null,"kv,0,0",{"$f":"IF(G4=RefText_DB!$B$9,1.76,IF(G4=RefText_DB!$B$10,3.05,IF(G4=RefText_DB!$B$11,2.47,\"errore\")))","v":3.05},"N/mm3"]
[null,"Kv,ser",{"$f":"C8*C7*C6*C5","v":274500},"N/mm  ",null,"Kv,ser",{"$f":"G8*G7*G6*G5","v":137250},"N/mm  "]
[]
{"$rows_left_out":5}
{"sheet":"CLT panel","index":9,"n_rows":48,"n_cols":18,"rows_kept":48,"hidden":true}
[]
[null,"CLT"]
[null,null,"Prod","h","Layers","Layers (code)","Code","9","7","5","3","0","3'","5'","7'","9'"]
[null,null,"HASSLACHER",{"$f":"SUM(CLT[[#This Row],[9]:[9'']])","v":60},{"$f":"LEFT(CLT[[#This Row],[Layers (code)]],1)","v":"3"},3,{"$f":"_xlfn.CONCAT(D4, \"mm-\",F4,\"s\", \"-\",H4,\" \",I4,\" \",J4,\" \",K4,\" \",L4,\" \",M4,\" \",N4,\" \",O4,\" \",P4)","v":"60mm-3s-   20 20 20   "},{"$nulls":3},20,20,20]
[null,null,"HASSLACHER",{"$f":"SUM(CLT[[#This Row],[9]:[9'']])","v":80},{"$f":"LEFT(CLT[[#This Row],[Layers (code)]],1)","v":"3"},3,{"$f":"_xlfn.CONCAT(D5, \"mm-\",F5, \"-\",H5,\" \",I5,\" \",J5,\" \",K5,\" \",L5,\" \",M5,\" \",N5,\" \",O5,\" \",P5)","v":"80mm-3-   20 40 20   "},{"$nulls":3},20,40,20]
[null,null,"STORA",{"$f":"SUM(CLT[[#This Row],[9]:[9'']])","v":80},{"$f":"LEFT(CLT[[#This Row],[Layers (code)]],1)","v":"3"},3,"80mm-3-   30 20 30   ",{"$nulls":3},30,20,30]
[null,null,"HASSLACHER",{"$f":"SUM(CLT[[#This Row],[9]:[9'']])","v":90},{"$f":"LEFT(CLT[[#This Row],[Layers (code)]],1)","v":"3"},3,"90mm-3-   30 30 30   ",{"$nulls":3},30,30,30]
[null,null,"HASSLACHER",{"$f":"SUM(CLT[[#This Row],[9]:[9'']])","v":100},{"$f":"LEFT(CLT[[#This Row],[Layers (code)]],1)","v":"3"},3,"100mm-3-   30 40 30   ",{"$nulls":3},30,40,30,{"$nulls":4},"80308030803080"]
[null,null,"HASSLACHER",{"$f":"SUM(CLT[[#This Row],[9]:[9'']])","v":120},{"$f":"LEFT(CLT[[#This Row],[Layers (code)]],1)","v":"3"},3,"120mm-3-   40 40 40   ",{"$nulls":3},40,40,40,{"$nulls":4},"80308030803080"]
[null,null,"HASSLACHER",{"$f":"SUM(CLT[[#This Row],[9]:[9'']])","v":100},{"$f":"LEFT(CLT[[#This Row],[Layers (code)]],1)","v":"5"},5,"100mm-5-  20 20 20 20 20  ",null,null,20,20,20,20,20]
{"$rows_left_out":39}
{"sheet":"Dati","index":10,"n_rows":117,"n_cols":19,"rows_kept":117,"hidden":true,"merged":[[104,2,104,3],[105,3,105,4]]}
[]
["Tipo legno secondo EN338:2016, UNIEN14080:2013"]
["Classe","fm,k","ft,0,k","ft,90,k","fc,0,k","fc,90,k","fv,k","fr,k","E0,mean","E0,05","E90,mean","E90,05","Gmean","G05","Gr,mean","Gr,05","ρk","ρmean","γM"]
["GL20h - UNI EN14080:2013",20,16,0.5,20,2.5,3.5,1.2,8400,7000,300,250,650,540,65,54,340,370,{"$f":"IF(LEFT(TimberType[[#This Row],[Classe]])=\"GL\",IF(Input!$I$5=RefText_DB!$B$4,1.25,1.45),IF(Input!$I$5=RefText_DB!$B$4,1.3,1.5))","v":1.3}]
["GL22h - UNI EN14080:2013",22,17.6,0.5,22,2.5,3.5,1.2,10500,8800,300,250,650,540,65,54,370,410,{"$f":"IF(LEFT(TimberType[[#This Row],[Classe]])=\"GL\",IF(Input!$I$5=RefText_DB!$B$4,1.25,1.45),IF(Input!$I$5=RefText_DB!$B$4,1.3,1.5))","v":1.3}]
["GL24h - UNI EN14080:2013",24,19.2,0.5,24,2.5,3.5,1.2,11500,9600,300,250,650,540,65,54,385,420,{"$f":"IF(LEFT(TimberType[[#This Row],[Classe]])=\"GL\",IF(Input!$I$5=RefText_DB!$B$4,1.25,1.45),IF(Input!$I$5=RefText_DB!$B$4,1.3,1.5))","v":1.3}]
["GL26h - UNI EN14080:2013",26,20.8,0.5,26,2.5,3.5,1.2,12100,10100,300,250,650,540,65,54,405,445,{"$f":"IF(LEFT(TimberType[[#This Row],[Classe]])=\"GL\",IF(Input!$I$5=RefText_DB!$B$4,1.25,1.45),IF(Input!$I$5=RefText_DB!$B$4,1.3,1.5))","v":1.3}]
["GL28h - UNI EN14080:2013",28,22.3,0.5,28,2.5,3.5,1.2,12600,10500,300,250,650,540,65,54,425,460,{"$f":"IF(LEFT(TimberType[[#This Row],[Classe]])=\"GL\",IF(Input!$I$5=RefText_DB!$B$4,1.25,1.45),IF(Input!$I$5=RefText_DB!$B$4,1.3,1.5))","v":1.3}]
["GL30h - UNI EN14080:2013",30,24,0.5,30,2.5,3.5,1.2,13600,11300,300,250,650,540,65,54,430,480,{"$f":"IF(LEFT(TimberType[[#This Row],[Classe]])=\"GL\",IF(Input!$I$5=RefText_DB!$B$4,1.25,1.45),IF(Input!$I$5=RefText_DB!$B$4,1.3,1.5))","v":1.3}]
["GL32h - UNI EN14080:2013",32,25.6,0.5,32,2.5,3.5,1.2,14200,11800,300,250,650,540,65,54,440,490,{"$f":"IF(LEFT(TimberType[[#This Row],[Classe]])=\"GL\",IF(Input!$I$5=RefText_DB!$B$4,1.25,1.45),IF(Input!$I$5=RefText_DB!$B$4,1.3,1.5))","v":1.3}]
{"$rows_left_out":107}